Page MenuHomeGitPull.it

Build 1420
AbortedPublic

Properties

Drydock: Assemble debug APK using Docker Fabione asd

When
Completed at May 30 2026, 13:38 · Built for 3 m, 21 s
Status
Failed
Description

This step will build an .apk using Gradle using this fantastic Docker image:

https://gitlab.com/fabmazz/android-fdroid-build-container/-/tree/ubuntu

Source code of this build step:

https://gitpull.it/source/libre-busto-ci-cd/browse/master/bin/fdroid-docker-builder.sh

TODO: Use the official image by Fabio Mazza, when the "DESIRED_UID" / "DESIRED_GID" features will be merged.

Build Log 6621 (remote - stderr)
25 - 50 - 100 - Unlimited Lines

404 at org.gradle.internal.model.StateTransitionController.doTransition(StateTransitionController.java:266)
405 at org.gradle.internal.model.StateTransitionController.lambda$tryTransition$8(StateTransitionController.java:177)
406 at org.gradle.internal.work.DefaultSynchronizer.withLock(DefaultSynchronizer.java:46)
407 at org.gradle.internal.model.StateTransitionController.tryTransition(StateTransitionController.java:177)
408 at org.gradle.internal.build.DefaultBuildLifecycleController.executeTasks(DefaultBuildLifecycleController.java:304)
409 at org.gradle.internal.build.DefaultBuildWorkGraphController$DefaultBuildWorkGraph.runWork(DefaultBuildWorkGraphController.java:220)
410 at org.gradle.internal.work.DefaultWorkerLeaseService.withLocks(DefaultWorkerLeaseService.java:263)
411 at org.gradle.internal.work.DefaultWorkerLeaseService.runAsWorkerThread(DefaultWorkerLeaseService.java:127)
412 at org.gradle.composite.internal.DefaultBuildController.doRun(DefaultBuildController.java:181)
413 at org.gradle.composite.internal.DefaultBuildController.access$000(DefaultBuildController.java:50)
414 at org.gradle.composite.internal.DefaultBuildController$BuildOpRunnable.lambda$run$0(DefaultBuildController.java:198)
415 at org.gradle.internal.operations.CurrentBuildOperationRef.with(CurrentBuildOperationRef.java:85)
416 at org.gradle.composite.internal.DefaultBuildController$BuildOpRunnable.run(DefaultBuildController.java:198)
417 at org.gradle.internal.concurrent.ExecutorPolicy$CatchAndRecordFailures.onExecute(ExecutorPolicy.java:64)
418 at org.gradle.internal.concurrent.AbstractManagedExecutor$1.run(AbstractManagedExecutor.java:48)
419Caused by: org.jetbrains.kotlin.gradle.tasks.FailedCompilationException: Internal compiler error. See log for more details
420 at org.jetbrains.kotlin.gradle.tasks.TasksUtilsKt.throwExceptionIfCompilationFailed(tasksUtils.kt:22)
421 at org.jetbrains.kotlin.compilerRunner.GradleKotlinCompilerWork.run(GradleKotlinCompilerWork.kt:119)
422 at org.jetbrains.kotlin.compilerRunner.GradleCompilerRunnerWithWorkers$GradleKotlinCompilerWorkAction.execute(GradleCompilerRunnerWithWorkers.kt:74)
423 at org.gradle.workers.internal.DefaultWorkerServer.execute(DefaultWorkerServer.java:63)
424 at org.gradle.workers.internal.NoIsolationWorkerFactory$1$1.create(NoIsolationWorkerFactory.java:66)
425 at org.gradle.workers.internal.NoIsolationWorkerFactory$1$1.create(NoIsolationWorkerFactory.java:62)
426 at org.gradle.internal.classloader.ClassLoaderUtils.executeInClassloader(ClassLoaderUtils.java:100)
427 at org.gradle.workers.internal.NoIsolationWorkerFactory$1.lambda$execute$0(NoIsolationWorkerFactory.java:62)
428 at org.gradle.workers.internal.AbstractWorker$1.call(AbstractWorker.java:44)
429 at org.gradle.workers.internal.AbstractWorker$1.call(AbstractWorker.java:41)
430 at org.gradle.internal.operations.DefaultBuildOperationRunner$CallableBuildOperationWorker.execute(DefaultBuildOperationRunner.java:210)
431 at org.gradle.internal.operations.DefaultBuildOperationRunner$CallableBuildOperationWorker.execute(DefaultBuildOperationRunner.java:205)
432 at org.gradle.internal.operations.DefaultBuildOperationRunner$2.execute(DefaultBuildOperationRunner.java:67)
433 at org.gradle.internal.operations.DefaultBuildOperationRunner$2.execute(DefaultBuildOperationRunner.java:60)
434 at org.gradle.internal.operations.DefaultBuildOperationRunner.execute(DefaultBuildOperationRunner.java:167)
435 at org.gradle.internal.operations.DefaultBuildOperationRunner.execute(DefaultBuildOperationRunner.java:60)
436 at org.gradle.internal.operations.DefaultBuildOperationRunner.call(DefaultBuildOperationRunner.java:54)
437 at org.gradle.workers.internal.AbstractWorker.executeWrappedInBuildOperation(AbstractWorker.java:41)
438 at org.gradle.workers.internal.NoIsolationWorkerFactory$1.execute(NoIsolationWorkerFactory.java:59)
439 at org.gradle.workers.internal.DefaultWorkerExecutor.lambda$submitWork$0(DefaultWorkerExecutor.java:174)
440 at org.gradle.internal.work.DefaultConditionalExecutionQueue$ExecutionRunner.runExecution(DefaultConditionalExecutionQueue.java:194)
441 at org.gradle.internal.work.DefaultConditionalExecutionQueue$ExecutionRunner.access$700(DefaultConditionalExecutionQueue.java:127)
442 at org.gradle.internal.work.DefaultConditionalExecutionQueue$ExecutionRunner$1.run(DefaultConditionalExecutionQueue.java:169)
443 at org.gradle.internal.Factories$1.create(Factories.java:31)
444 at org.gradle.internal.work.DefaultWorkerLeaseService.withLocks(DefaultWorkerLeaseService.java:263)
445 at org.gradle.internal.work.DefaultWorkerLeaseService.runAsWorkerThread(DefaultWorkerLeaseService.java:127)
446 at org.gradle.internal.work.DefaultWorkerLeaseService.runAsWorkerThread(DefaultWorkerLeaseService.java:132)
447 at org.gradle.internal.work.DefaultConditionalExecutionQueue$ExecutionRunner.runBatch(DefaultConditionalExecutionQueue.java:164)
448 at org.gradle.internal.work.DefaultConditionalExecutionQueue$ExecutionRunner.run(DefaultConditionalExecutionQueue.java:133)
449 ... 2 more
450
451
452BUILD FAILED in 3m 11s
453

Build Log 6620 (remote - stdout)
25 - 50 - 100 - Unlimited Lines

71> Task :app:processGitpullNavigationResources
72> Task :app:compileGitpullNavigationResources
73> Task :app:generateGitpullResValues
74> Task :app:mapGitpullSourceSetPaths
75> Task :app:extractGitpullSupportedLocales
76> Task :app:generateGitpullLocaleConfig
77> Task :app:generateGitpullResources
78> Task :app:createGitpullCompatibleScreenManifests
79> Task :app:extractDeepLinksGitpull
80
81> Task :app:processGitpullMainManifest
82/home/vagrant/appbuild/app/src/gitpull/AndroidManifest.xml Warning:
83 service#info.mqtt.android.service.MqttService was tagged at AndroidManifest.xml:0 to replace another declaration but no other declaration present
84/home/vagrant/appbuild/app/src/gitpull/AndroidManifest.xml Warning:
85 provider#org.acra.attachment.AcraContentProvider@android:authorities was tagged at AndroidManifest.xml:0 to replace other declarations but no other declaration present
86
87> Task :app:mergeGitpullResources
88> Task :app:processGitpullManifest
89> Task :app:javaPreCompileGitpull
90> Task :app:desugarGitpullFileDependencies
91> Task :app:mergeGitpullStartupProfile
92> Task :app:processGitpullManifestForPackage
93> Task :app:mergeExtDexGitpull
94> Task :app:mergeGitpullShaders
95> Task :app:compileGitpullShaders NO-SOURCE
96> Task :app:generateGitpullAssets UP-TO-DATE
97> Task :app:mergeGitpullAssets
98> Task :app:compressGitpullAssets
99> Task :app:extractGitpullVersionControlInfo
100> Task :app:extractProguardFiles
101> Task :app:collectGitpullDependencies
102> Task :app:sdkGitpullDependencyData
103> Task :app:writeGitpullAppMetadata
104> Task :app:writeGitpullSigningConfigVersions
105> Task :app:processGitpullResources
106> Task :app:optimizeGitpullResources
107> Task :app:kspGitpullKotlin
108w: [ksp] /home/vagrant/appbuild/app/src/main/java/it/reyboz/bustorino/data/gtfs/GtfsAgency.kt:21: Primary key constraint on gtfsId is ignored when being merged into it.reyboz.bustorino.data.gtfs.GtfsAgency
109
110> Task :app:compileGitpullKotlin FAILED
111
112[Incubating] Problems report is available at: file:///home/vagrant/appbuild/build/reports/problems/problems-report.html
113
114Deprecated Gradle features were used in this build, making it incompatible with Gradle 9.0.
115
116You can use '--warning-mode all' to show the individual deprecation warnings and determine if they come from your own scripts or plugins.
117
118For more on this, please refer to https://docs.gradle.org/8.13/userguide/command_line_interface.html#sec:command_line_warnings in the Gradle documentation.
11944 actionable tasks: 44 executed
120

Lease BusTO Working Copy

When
Completed at May 30 2026, 13:35 · Built for 3 s
Status
Passed

Abort Older Builds

When
Completed at May 30 2026, 13:35 · Built instantly
Status
Passed