Page MenuHomeGitPull.it

Build 259

Drydock: Run Gradle Lint Command

When
Completed at Feb 22 2021, 23:21 · Built for 23 s
Status
Failed
Description

Run a gradle lint.

It does not run the ./gradlew in order to do not provide an attack vector from untrusted commits.

Build Log 893 (remote - stderr)
25 - 50 - 100 - Unlimited Lines

109 location: class id
110/var/drydock/workingcopy-79/repo/libre-busto/src/it/reyboz/bustorino/ActivityMain.java:661: error: cannot find symbol
111 ft.add(R.id.resultFrame, fragment, "nearbyStop_correct");
112 ^
113 symbol: variable resultFrame
114 location: class id
115Note: Some input files use or override a deprecated API.
116Note: Recompile with -Xlint:deprecation for details.
117Note: /var/drydock/workingcopy-79/repo/libre-busto/src/it/reyboz/bustorino/middleware/AsyncDataDownload.java uses unchecked or unsafe operations.
118Note: Recompile with -Xlint:unchecked for details.
11923 errors
120
121FAILURE: Build failed with an exception.
122
123* What went wrong:
124Execution failed for task ':compileDebugJavaWithJavac'.
125> Compilation failed; see the compiler error output for details.
126
127* Try:
128Run with --stacktrace option to get the stack trace. Run with --info or --debug option to get more log output. Run with --scan to get full insights.
129
130* Get more help at https://help.gradle.org
131
132BUILD FAILED in 22s
133

Build Log 892 (remote - stdout)
25 - 50 - 100 - Unlimited Lines

1Found 6.1.1 via distributionUrl
2Running /home/phabricator-android-builder/versions/6.1.1/bin/gradle lint
3Starting a Gradle Daemon (subsequent builds will be faster)
4> Task :preBuild UP-TO-DATE
5> Task :preDebugBuild UP-TO-DATE
6> Task :compileDebugAidl NO-SOURCE
7> Task :generateDebugBuildConfig UP-TO-DATE
8> Task :compileDebugRenderscript UP-TO-DATE
9> Task :javaPreCompileDebug UP-TO-DATE
10> Task :generateDebugResValues UP-TO-DATE
11> Task :generateDebugResources UP-TO-DATE
12> Task :mergeDebugResources
13> Task :createDebugCompatibleScreenManifests UP-TO-DATE
14> Task :extractDeepLinksDebug UP-TO-DATE
15> Task :processDebugManifest UP-TO-DATE
16> Task :processDebugResources
17
18> Task :compileDebugJavaWithJavac
19
20> Task :compileDebugJavaWithJavac FAILED
2110 actionable tasks: 3 executed, 7 up-to-date
22

Lease BusTO Working Copy

When
Completed at Feb 22 2021, 23:20 · Built for 2 s
Status
Passed

Wait for Previous Commits to Build

When
Completed at Feb 22 2021, 23:20 · Built instantly
Status
Passed

Event Timeline