Page MenuHomeGitPull.it

Build 291

Drydock: Run Gradle Lint Command

When
Completed at May 2 2021, 11:43 · Built for 5 s
Status
Failed
Description

Run a gradle lint.

It does not run the ./gradlew in order to do not provide an attack vector from untrusted commits.

Build Log 1087 (remote - stderr)
25 - 50 - 100 - Unlimited Lines

1
2FAILURE: Build failed with an exception.
3
4* What went wrong:
5Execution failed for task ':processDebugResources'.
6> A failure occurred while executing com.android.build.gradle.internal.tasks.Workers$ActionFacade
7 > Android resource linking failed
8 /var/drydock/workingcopy-112/repo/libre-busto/res/menu/extra_menu_items.xml:9: AAPT: error: resource string/action_hack (aka it.reyboz.bustorino.debug:string/action_hack) not found.
9
10
11* Try:
12Run with --stacktrace option to get the stack trace. Run with --info or --debug option to get more log output. Run with --scan to get full insights.
13
14* Get more help at https://help.gradle.org
15
16BUILD FAILED in 5s
17

Build Log 1086 (remote - stdout)
25 - 50 - 100 - Unlimited Lines

12
13> Task :processDebugManifest
14/var/drydock/workingcopy-112/repo/libre-busto/src/debug/AndroidManifest.xml:39:9-45:51 Warning:
15 provider#org.acra.attachment.AcraContentProvider@android:authorities was tagged at AndroidManifest.xml:39 to replace other declarations but no other declaration present
16
17> Task :preReleaseBuild UP-TO-DATE
18> Task :compileReleaseAidl NO-SOURCE
19> Task :compileReleaseRenderscript
20> Task :generateReleaseBuildConfig
21> Task :generateReleaseResValues
22> Task :generateReleaseResources
23> Task :createReleaseCompatibleScreenManifests
24> Task :extractDeepLinksRelease
25
26> Task :processReleaseManifest
27/var/drydock/workingcopy-112/repo/libre-busto/AndroidManifest.xml:39:9-45:51 Warning:
28 provider#org.acra.attachment.AcraContentProvider@android:authorities was tagged at AndroidManifest.xml:39 to replace other declarations but no other declaration present
29
30> Task :prepareLintJar UP-TO-DATE
31> Task :mergeDebugResources
32> Task :processDebugResources FAILED
33> Task :mergeReleaseResources
34> Task :javaPreCompileRelease
3518 actionable tasks: 17 executed, 1 up-to-date
36

Drydock: Clean Gradle

When
Completed at May 2 2021, 11:43 · Built for 2 s
Status
Passed
Description

Clean Gradle directory to avoid nasty errors like:

https://gitpull.it/harbormaster/build/273/

1 empty logs are hidden. Show all logs.

Build Log 1084 (remote - stdout)
25 - 50 - 100 - Unlimited Lines

1Found 6.1.1 via distributionUrl
2Running /home/phabricator-android-builder/versions/6.1.1/bin/gradle clean
3> Task :clean
4
5BUILD SUCCESSFUL in 1s
61 actionable task: 1 executed
7

Lease BusTO Working Copy

When
Completed at May 2 2021, 11:43 · Built for 2 s
Status
Passed

Wait for Previous Commits to Build

When
Completed at May 2 2021, 11:43 · Built instantly
Status
Passed

Event Timeline