Page MenuHomeGitPull.it

Properties

Buildable
B37: Diff 54
Build Plan
Plan 2 BusTO Build Plan
Status
Failed

Drydock: Run Gradle Lint Command

When
Completed at Mar 14 2020, 16:23 · Built for 5 s
Status
Failed
Description

Run a gradle lint.

It does not run the ./gradlew in order to do not provide an attack vector from untrusted commits.

Build Log 133 (remote - stderr)
25 - 50 - 100 - Unlimited Lines

1Note: Some input files use or override a deprecated API.
2Note: Recompile with -Xlint:deprecation for details.
3Note: /var/drydock/workingcopy-33/repo/libre-busto/src/it/reyboz/bustorino/middleware/AsyncDataDownload.java uses unchecked or unsafe operations.
4Note: Recompile with -Xlint:unchecked for details.
5
6FAILURE: Build failed with an exception.
7
8* What went wrong:
9Execution failed for task ':mergeReleaseResources'.
10> Error: java.util.concurrent.ExecutionException: com.android.builder.internal.aapt.v2.Aapt2Exception: AAPT2 error: check logs for details
11
12* Try:
13Run with --stacktrace option to get the stack trace. Run with --info or --debug option to get more log output. Run with --scan to get full insights.
14
15* Get more help at https://help.gradle.org
16
17BUILD FAILED in 4s
18

Build Log 132 (remote - stdout)
25 - 50 - 100 - Unlimited Lines

15:generateDebugSources
16:javaPreCompileDebug UP-TO-DATE
17:compileDebugJavaWithJavac
18:preReleaseBuild UP-TO-DATE
19:compileReleaseAidl UP-TO-DATE
20:compileReleaseRenderscript
21:checkReleaseManifest UP-TO-DATE
22:generateReleaseBuildConfig UP-TO-DATE
23:mainApkListPersistenceRelease UP-TO-DATE
24:generateReleaseResValues UP-TO-DATE
25:generateReleaseResources
26:mergeReleaseResources
27/var/drydock/workingcopy-33/repo/libre-busto/res/drawable-xxxhdpi/ic_star_orange.png: error: failed to read PNG signature: file does not start with PNG signature.
28/var/drydock/workingcopy-33/repo/libre-busto/res/drawable-xxxhdpi/ic_star_outline_orange.png: error: failed to read PNG signature: file does not start with PNG signature.
29/var/drydock/workingcopy-33/repo/libre-busto/res/drawable-hdpi/ic_star_outline_orange.png: error: failed to read PNG signature: file does not start with PNG signature.
30/var/drydock/workingcopy-33/repo/libre-busto/res/drawable-hdpi/ic_star_orange.png: error: failed to read PNG signature: file does not start with PNG signature.
31/var/drydock/workingcopy-33/repo/libre-busto/res/drawable-xxhdpi/ic_star_outline_orange.png: error: failed to read PNG signature: file does not start with PNG signature.
32/var/drydock/workingcopy-33/repo/libre-busto/res/drawable-xhdpi/ic_star_outline_orange.png: error: failed to read PNG signature: file does not start with PNG signature.
33/var/drydock/workingcopy-33/repo/libre-busto/res/drawable-xhdpi/ic_star_orange.png: error: failed to read PNG signature: file does not start with PNG signature.
34/var/drydock/workingcopy-33/repo/libre-busto/res/drawable-xxhdpi/ic_star_orange.png: error: failed to read PNG signature: file does not start with PNG signature.
35/var/drydock/workingcopy-33/repo/libre-busto/res/drawable-mdpi/ic_star_outline_orange.png: error: failed to read PNG signature: file does not start with PNG signature.
36/var/drydock/workingcopy-33/repo/libre-busto/res/drawable-mdpi/ic_star_orange.png: error: failed to read PNG signature: file does not start with PNG signature.
37:mergeReleaseResources FAILED
3823 actionable tasks: 6 executed, 17 up-to-date
39

Lease BusTO Working Copy

When
Completed at Mar 14 2020, 16:22 · Built for 3 s
Status
Passed

Sleep

When
Completed at Mar 14 2020, 16:22 · Built for 5 s
Status
Passed

Abort Older Builds

When
Completed at Mar 14 2020, 16:22 · Built instantly
Status
Passed

Event Timeline