Page MenuHomeGitPull.it

Properties

Buildable
B43: Diff 63
Build Plan
Plan 2 BusTO Build Plan
Status
Failed

Drydock: Run Gradle Lint Command

When
Completed at Mar 14 2020, 19:41 · Built for 5 s
Status
Failed
Description

Run a gradle lint.

It does not run the ./gradlew in order to do not provide an attack vector from untrusted commits.

Build Log 149 (remote - stderr)
25 - 50 - 100 - Unlimited Lines

1/var/drydock/workingcopy-34/repo/libre-busto/src/it/reyboz/bustorino/ActivityMain.java:899: error: reached end of file while parsing
2 }
3 ^
41 error
5
6FAILURE: Build failed with an exception.
7
8* What went wrong:
9Execution failed for task ':compileDebugJavaWithJavac'.
10> Compilation failed; see the compiler error output for details.
11
12* Try:
13Run with --stacktrace option to get the stack trace. Run with --info or --debug option to get more log output. Run with --scan to get full insights.
14
15* Get more help at https://help.gradle.org
16
17BUILD FAILED in 3s
18

Build Log 148 (remote - stdout)
25 - 50 - 100 - Unlimited Lines

1:preBuild UP-TO-DATE
2:preDebugBuild UP-TO-DATE
3:compileDebugAidl UP-TO-DATE
4:compileDebugRenderscript
5:checkDebugManifest UP-TO-DATE
6:generateDebugBuildConfig UP-TO-DATE
7:prepareLintJar UP-TO-DATE
8:mainApkListPersistenceDebug UP-TO-DATE
9:generateDebugResValues UP-TO-DATE
10:generateDebugResources
11:mergeDebugResources
12:createDebugCompatibleScreenManifests UP-TO-DATE
13:processDebugManifest UP-TO-DATE
14:splitsDiscoveryTaskDebug UP-TO-DATE
15:processDebugResources
16:generateDebugSources
17:javaPreCompileDebug UP-TO-DATE
18:compileDebugJavaWithJavac FAILED
1915 actionable tasks: 4 executed, 11 up-to-date
20

Lease BusTO Working Copy

When
Completed at Mar 14 2020, 19:40 · Built for 4 s
Status
Passed

Sleep

When
Completed at Mar 14 2020, 19:40 · Built for 5 s
Status
Passed

Abort Older Builds

When
Completed at Mar 14 2020, 19:40 · Built instantly
Status
Passed

Event Timeline