Page MenuHomeGitPull.it

Build 1500
FailedPublic

Drydock: Assemble debug APK using Docker Fabione asd

When
Completed at Fri, Oct 9, 12:08 · Built for 1 m, 25 s
Status
Failed
Description

This step will build an .apk using Gradle using this fantastic Docker image:

https://gitlab.com/fabmazz/android-fdroid-build-container/-/tree/ubuntu

Source code of this build step:

https://gitpull.it/source/libre-busto-ci-cd/browse/master/bin/fdroid-docker-builder.sh

TODO: Use the official image by Fabio Mazza, when the "DESIRED_UID" / "DESIRED_GID" features will be merged.

Build Log 6806 (remote - stderr)
25 - 50 - 100 - Unlimited Lines

1+ docker run -e DESIRED_UID=1004 -e DESIRED_GID=1004 --rm -v /var/drydock/workingcopy-112/repo/libre-busto:/home/vagrant/appbuild:Z fdroid-asder launch_build_local -Dorg.gradle.jvmargs=-Xmx2g --stacktrace assembleGitpull
2/home/vagrant/appbuild/app/src/main/res/values-it/strings.xml:65:4: Failed to flatten XML for resource 'about_channel' with error: Invalid unicode escape sequence in string
3"{str}"
4/home/vagrant/appbuild/app/src/main/res/values-it/strings.xml:65:4: string/about_channel does not contain a valid string resource.
5
6FAILURE: Build failed with an exception.
7
8* What went wrong:
9Execution failed for task ':app:mergeGitpullResources'.
10> A failure occurred while executing com.android.build.gradle.internal.res.ResourceCompilerRunnable
11 > Resource compilation failed (Failed to compile values resource file /home/vagrant/appbuild/app/build/intermediates/incremental/gitpull/mergeGitpullResources/merged.dir/values-it/values-it.xml. Cause: java.lang.IllegalStateException: Can not extract resource from com.android.aaptcompiler.ParsedResource@6580802d.). Check logs for more details.
12
13* Try:
14> Run with --info or --debug option to get more log output.
15> Run with --scan to get full insights from a Build Scan (powered by Develocity).
16> Get more help at https://help.gradle.org.
17
18* Exception is:
19org.gradle.api.tasks.TaskExecutionException: Execution failed for task ':app:mergeGitpullResources'.
20 at org.gradle.api.internal.tasks.execution.ExecuteActionsTaskExecuter.lambda$executeIfValid$1(ExecuteActionsTaskExecuter.java:135)
21 at org.gradle.internal.Try$Failure.ifSuccessfulOrElse(Try.java:288)
22 at org.gradle.api.internal.tasks.execution.ExecuteActionsTaskExecuter.executeIfValid(ExecuteActionsTaskExecuter.java:133)
23 at org.gradle.api.internal.tasks.execution.ExecuteActionsTaskExecuter.execute(ExecuteActionsTaskExecuter.java:121)
24 at org.gradle.api.internal.tasks.execution.ProblemsTaskPathTrackingTaskExecuter.execute(ProblemsTaskPathTrackingTaskExecuter.java:41)
25 at org.gradle.api.internal.tasks.execution.FinalizePropertiesTaskExecuter.execute(FinalizePropertiesTaskExecuter.java:46)
26 at org.gradle.api.internal.tasks.execution.ResolveTaskExecutionModeExecuter.execute(ResolveTaskExecutionModeExecuter.java:51)
27 at org.gradle.api.internal.tasks.execution.SkipTaskWithNoActionsExecuter.execute(SkipTaskWithNoActionsExecuter.java:57)
28 at org.gradle.api.internal.tasks.execution.SkipOnlyIfTaskExecuter.execute(SkipOnlyIfTaskExecuter.java:74)
29 at org.gradle.api.internal.tasks.execution.CatchExceptionTaskExecuter.execute(CatchExceptionTaskExecuter.java:36)
30 at org.gradle.api.internal.tasks.execution.EventFiringTaskExecuter$1.executeTask(EventFiringTaskExecuter.java:77)
31 at org.gradle.api.internal.tasks.execution.EventFiringTaskExecuter$1.call(EventFiringTaskExecuter.java:55)
32 at org.gradle.api.internal.tasks.execution.EventFiringTaskExecuter$1.call(EventFiringTaskExecuter.java:52)
33 at org.gradle.internal.operations.DefaultBuildOperationRunner$CallableBuildOperationWorker.execute(DefaultBuildOperationRunner.java:209)
34 at org.gradle.internal.operations.DefaultBuildOperationRunner$CallableBuildOperationWorker.execute(DefaultBuildOperationRunner.java:204)
35 at org.gradle.internal.operations.DefaultBuildOperationRunner$2.execute(DefaultBuildOperationRunner.java:66)
36 at org.gradle.internal.operations.DefaultBuildOperationRunner$2.execute(DefaultBuildOperationRunner.java:59)
37 at org.gradle.internal.operations.DefaultBuildOperationRunner.execute(DefaultBuildOperationRunner.java:166)
38 at org.gradle.internal.operations.DefaultBuildOperationRunner.execute(DefaultBuildOperationRunner.java:59)
39 at org.gradle.internal.operations.DefaultBuildOperationRunner.call(DefaultBuildOperationRunner.java:53)
40 at org.gradle.api.internal.tasks.execution.EventFiringTaskExecuter.execute(EventFiringTaskExecuter.java:52)
41 at org.gradle.execution.plan.DefaultNodeExecutor.executeLocalTaskNode(DefaultNodeExecutor.java:55)
42 at org.gradle.execution.plan.DefaultNodeExecutor.execute(DefaultNodeExecutor.java:34)
43 at org.gradle.execution.taskgraph.DefaultTaskExecutionGraph$InvokeNodeExecutorsAction.execute(DefaultTaskExecutionGraph.java:355)
44 at org.gradle.execution.taskgraph.DefaultTaskExecutionGraph$InvokeNodeExecutorsAction.execute(DefaultTaskExecutionGraph.java:343)
45 at org.gradle.execution.taskgraph.DefaultTaskExecutionGraph$BuildOperationAwareExecutionAction.lambda$execute$0(DefaultTaskExecutionGraph.java:339)
46 at org.gradle.internal.operations.CurrentBuildOperationRef.with(CurrentBuildOperationRef.java:84)
47 at org.gradle.execution.taskgraph.DefaultTaskExecutionGraph$BuildOperationAwareExecutionAction.execute(DefaultTaskExecutionGraph.java:339)
48 at org.gradle.execution.taskgraph.DefaultTaskExecutionGraph$BuildOperationAwareExecutionAction.execute(DefaultTaskExecutionGraph.java:328)
49 at org.gradle.execution.plan.DefaultPlanExecutor$ExecutorWorker.execute(DefaultPlanExecutor.java:459)
50 at org.gradle.execution.plan.DefaultPlanExecutor$ExecutorWorker.run(DefaultPlanExecutor.java:376)
51 at org.gradle.internal.concurrent.ExecutorPolicy$CatchAndRecordFailures.onExecute(ExecutorPolicy.java:64)
52 at org.gradle.internal.concurrent.AbstractManagedExecutor$1.run(AbstractManagedExecutor.java:47)
53Caused by: org.gradle.workers.internal.DefaultWorkerExecutor$WorkExecutionException: A failure occurred while executing com.android.build.gradle.internal.res.ResourceCompilerRunnable
54 at org.gradle.workers.internal.DefaultWorkerExecutor$WorkItemExecution.waitForCompletion(DefaultWorkerExecutor.java:289)
55 at org.gradle.internal.work.DefaultAsyncWorkTracker.lambda$waitForItemsAndGatherFailures$2(DefaultAsyncWorkTracker.java:130)
56 at org.gradle.internal.Factories$1.create(Factories.java:30)
57 at org.gradle.internal.work.DefaultWorkerLeaseService.lambda$withoutLocks$2(DefaultWorkerLeaseService.java:344)
58 at org.gradle.internal.work.ResourceLockStatistics$1.measure(ResourceLockStatistics.java:42)
59 at org.gradle.internal.work.DefaultWorkerLeaseService.withoutLocks(DefaultWorkerLeaseService.java:342)
60 at org.gradle.internal.work.DefaultWorkerLeaseService.withoutLocks(DefaultWorkerLeaseService.java:326)
61 at org.gradle.internal.work.DefaultWorkerLeaseService.withoutLock(DefaultWorkerLeaseService.java:331)
62 at org.gradle.internal.work.DefaultAsyncWorkTracker.waitForItemsAndGatherFailures(DefaultAsyncWorkTracker.java:126)
63 at org.gradle.internal.work.DefaultAsyncWorkTracker.waitForItemsAndGatherFailures(DefaultAsyncWorkTracker.java:92)
64 at org.gradle.internal.work.DefaultAsyncWorkTracker.waitForAll(DefaultAsyncWorkTracker.java:78)
65 at org.gradle.internal.work.DefaultAsyncWorkTracker.waitForCompletion(DefaultAsyncWorkTracker.java:66)
66 at org.gradle.api.internal.tasks.execution.TaskExecution$3.run(TaskExecution.java:267)
67 at org.gradle.internal.operations.DefaultBuildOperationRunner$1.execute(DefaultBuildOperationRunner.java:29)
68 at org.gradle.internal.operations.DefaultBuildOperationRunner$1.execute(DefaultBuildOperationRunner.java:26)
69 at org.gradle.internal.operations.DefaultBuildOperationRunner$2.execute(DefaultBuildOperationRunner.java:66)
70 at org.gradle.internal.operations.DefaultBuildOperationRunner$2.execute(DefaultBuildOperationRunner.java:59)
71 at org.gradle.internal.operations.DefaultBuildOperationRunner.execute(DefaultBuildOperationRunner.java:166)
72 at org.gradle.internal.operations.DefaultBuildOperationRunner.execute(DefaultBuildOperationRunner.java:59)
73 at org.gradle.internal.operations.DefaultBuildOperationRunner.run(DefaultBuildOperationRunner.java:47)
74 at org.gradle.api.internal.tasks.execution.TaskExecution.executeAction(TaskExecution.java:244)
75 at org.gradle.api.internal.tasks.execution.TaskExecution.executeActions(TaskExecution.java:227)
76 at org.gradle.api.internal.tasks.execution.TaskExecution.executeWithPreviousOutputFiles(TaskExecution.java:210)
77 at org.gradle.api.internal.tasks.execution.TaskExecution.execute(TaskExecution.java:176)
78 at org.gradle.internal.execution.steps.ExecuteStep.executeInternal(ExecuteStep.java:110)
79 at org.gradle.internal.execution.steps.ExecuteStep.access$000(ExecuteStep.java:47)
80 at org.gradle.internal.execution.steps.ExecuteStep$1.call(ExecuteStep.java:64)
81 at org.gradle.internal.execution.steps.ExecuteStep$1.call(ExecuteStep.java:61)
82 at org.gradle.internal.operations.DefaultBuildOperationRunner$CallableBuildOperationWorker.execute(DefaultBuildOperationRunner.java:209)
83 at org.gradle.internal.operations.DefaultBuildOperationRunner$CallableBuildOperationWorker.execute(DefaultBuildOperationRunner.java:204)
84 at org.gradle.internal.operations.DefaultBuildOperationRunner$2.execute(DefaultBuildOperationRunner.java:66)
85 at org.gradle.internal.operations.DefaultBuildOperationRunner$2.execute(DefaultBuildOperationRunner.java:59)
86 at org.gradle.internal.operations.DefaultBuildOperationRunner.execute(DefaultBuildOperationRunner.java:166)
87 at org.gradle.internal.operations.DefaultBuildOperationRunner.execute(DefaultBuildOperationRunner.java:59)
88 at org.gradle.internal.operations.DefaultBuildOperationRunner.call(DefaultBuildOperationRunner.java:53)
89 at org.gradle.internal.execution.steps.ExecuteStep.execute(ExecuteStep.java:61)
90 at org.gradle.internal.execution.steps.ExecuteStep.execute(ExecuteStep.java:47)
91 at org.gradle.internal.execution.steps.CancelExecutionStep.execute(CancelExecutionStep.java:42)
92 at org.gradle.internal.execution.steps.TimeoutStep.executeWithoutTimeout(TimeoutStep.java:75)
93 at org.gradle.internal.execution.steps.TimeoutStep.execute(TimeoutStep.java:55)
94 at org.gradle.internal.execution.steps.PreCreateOutputParentsStep.execute(PreCreateOutputParentsStep.java:51)
95 at org.gradle.internal.execution.steps.PreCreateOutputParentsStep.execute(PreCreateOutputParentsStep.java:29)
96 at org.gradle.internal.execution.steps.RemovePreviousOutputsStep.executeMutable(RemovePreviousOutputsStep.java:70)
97 at org.gradle.internal.execution.steps.RemovePreviousOutputsStep.executeMutable(RemovePreviousOutputsStep.java:40)
98 at org.gradle.internal.execution.steps.MutableStep.execute(MutableStep.java:25)
99 at org.gradle.internal.execution.steps.BroadcastChangingOutputsStep.execute(BroadcastChangingOutputsStep.java:62)
100 at org.gradle.internal.execution.steps.BroadcastChangingOutputsStep.execute(BroadcastChangingOutputsStep.java:27)
101 at org.gradle.internal.execution.steps.CaptureOutputsAfterExecutionStep.execute(CaptureOutputsAfterExecutionStep.java:69)
102 at org.gradle.internal.execution.steps.CaptureOutputsAfterExecutionStep.execute(CaptureOutputsAfterExecutionStep.java:46)
103 at org.gradle.internal.execution.steps.ResolveInputChangesStep.executeMutable(ResolveInputChangesStep.java:39)
104 at org.gradle.internal.execution.steps.ResolveInputChangesStep.executeMutable(ResolveInputChangesStep.java:28)
105 at org.gradle.internal.execution.steps.MutableStep.execute(MutableStep.java:25)
106 at org.gradle.internal.execution.steps.BuildCacheStep.executeWithoutCache(BuildCacheStep.java:192)
107 at org.gradle.internal.execution.steps.BuildCacheStep.lambda$execute$1(BuildCacheStep.java:76)
108 at org.gradle.internal.Either$Right.fold(Either.java:176)
109 at org.gradle.internal.execution.caching.CachingState.fold(CachingState.java:62)
110 at org.gradle.internal.execution.steps.BuildCacheStep.execute(BuildCacheStep.java:74)
111 at org.gradle.internal.execution.steps.BuildCacheStep.execute(BuildCacheStep.java:49)
112 at org.gradle.internal.execution.steps.StoreExecutionStateStep.execute(StoreExecutionStateStep.java:46)
113 at org.gradle.internal.execution.steps.StoreExecutionStateStep.execute(StoreExecutionStateStep.java:35)
114 at org.gradle.internal.execution.steps.SkipUpToDateStep.executeBecause(SkipUpToDateStep.java:75)
115 at org.gradle.internal.execution.steps.SkipUpToDateStep.lambda$execute$2(SkipUpToDateStep.java:53)
116 at org.gradle.internal.execution.steps.SkipUpToDateStep.execute(SkipUpToDateStep.java:53)
117 at org.gradle.internal.execution.steps.SkipUpToDateStep.execute(SkipUpToDateStep.java:35)
118 at org.gradle.internal.execution.steps.legacy.MarkSnapshottingInputsFinishedStep.execute(MarkSnapshottingInputsFinishedStep.java:37)
119 at org.gradle.internal.execution.steps.legacy.MarkSnapshottingInputsFinishedStep.execute(MarkSnapshottingInputsFinishedStep.java:27)
120 at org.gradle.internal.execution.steps.ResolveIncrementalCachingStateStep.executeDelegate(ResolveIncrementalCachingStateStep.java:49)
121 at org.gradle.internal.execution.steps.ResolveIncrementalCachingStateStep.executeDelegate(ResolveIncrementalCachingStateStep.java:27)
122 at org.gradle.internal.execution.steps.AbstractResolveCachingStateStep.execute(AbstractResolveCachingStateStep.java:71)
123 at org.gradle.internal.execution.steps.AbstractResolveCachingStateStep.execute(AbstractResolveCachingStateStep.java:39)
124 at org.gradle.internal.execution.steps.ResolveChangesStep.executeMutable(ResolveChangesStep.java:63)
125 at org.gradle.internal.execution.steps.ResolveChangesStep.executeMutable(ResolveChangesStep.java:34)
126 at org.gradle.internal.execution.steps.MutableStep.execute(MutableStep.java:25)
127 at org.gradle.internal.execution.steps.ValidateStep.execute(ValidateStep.java:64)
128 at org.gradle.internal.execution.steps.ValidateStep.execute(ValidateStep.java:42)
129 at org.gradle.internal.execution.steps.AbstractCaptureStateBeforeExecutionStep.execute(AbstractCaptureStateBeforeExecutionStep.java:77)
130 at org.gradle.internal.execution.steps.AbstractCaptureStateBeforeExecutionStep.execute(AbstractCaptureStateBeforeExecutionStep.java:46)
131 at org.gradle.internal.execution.steps.AbstractSkipEmptyWorkStep.executeWithNonEmptySources(AbstractSkipEmptyWorkStep.java:133)
132 at org.gradle.internal.execution.steps.AbstractSkipEmptyWorkStep.execute(AbstractSkipEmptyWorkStep.java:59)
133 at org.gradle.internal.execution.steps.AbstractSkipEmptyWorkStep.execute(AbstractSkipEmptyWorkStep.java:36)
134 at org.gradle.internal.execution.steps.legacy.MarkSnapshottingInputsStartedStep.execute(MarkSnapshottingInputsStartedStep.java:38)
135 at org.gradle.internal.execution.steps.LoadPreviousExecutionStateStep.execute(LoadPreviousExecutionStateStep.java:36)
136 at org.gradle.internal.execution.steps.LoadPreviousExecutionStateStep.execute(LoadPreviousExecutionStateStep.java:23)
137 at org.gradle.internal.execution.steps.HandleStaleOutputsStep.executeMutable(HandleStaleOutputsStep.java:77)
138 at org.gradle.internal.execution.steps.HandleStaleOutputsStep.executeMutable(HandleStaleOutputsStep.java:43)
139 at org.gradle.internal.execution.steps.MutableStep.execute(MutableStep.java:25)
140 at org.gradle.internal.execution.steps.AssignMutableWorkspaceStep.lambda$execute$0(AssignMutableWorkspaceStep.java:35)
141 at org.gradle.api.internal.tasks.execution.TaskExecution$4.withWorkspace(TaskExecution.java:305)
142 at org.gradle.internal.execution.steps.AssignMutableWorkspaceStep.execute(AssignMutableWorkspaceStep.java:31)
143 at org.gradle.internal.execution.steps.AssignMutableWorkspaceStep.execute(AssignMutableWorkspaceStep.java:22)
144 at org.gradle.internal.execution.steps.ChoosePipelineStep.execute(ChoosePipelineStep.java:40)
145 at org.gradle.internal.execution.steps.ChoosePipelineStep.execute(ChoosePipelineStep.java:23)
146 at org.gradle.internal.execution.steps.ExecuteWorkBuildOperationFiringStep.lambda$execute$2(ExecuteWorkBuildOperationFiringStep.java:67)
147 at org.gradle.internal.execution.steps.ExecuteWorkBuildOperationFiringStep.execute(ExecuteWorkBuildOperationFiringStep.java:67)
148 at org.gradle.internal.execution.steps.ExecuteWorkBuildOperationFiringStep.execute(ExecuteWorkBuildOperationFiringStep.java:39)
149 at org.gradle.internal.execution.steps.IdentityCacheStep.execute(IdentityCacheStep.java:46)
150 at org.gradle.internal.execution.steps.IdentityCacheStep.execute(IdentityCacheStep.java:34)
151 at org.gradle.internal.execution.steps.IdentifyStep.execute(IdentifyStep.java:44)
152 at org.gradle.internal.execution.steps.IdentifyStep.execute(IdentifyStep.java:31)
153 at org.gradle.internal.execution.impl.DefaultExecutionEngine$1.execute(DefaultExecutionEngine.java:68)
154 at org.gradle.api.internal.tasks.execution.ExecuteActionsTaskExecuter.executeIfValid(ExecuteActionsTaskExecuter.java:132)
155 ... 30 more
156Caused by: com.android.aaptcompiler.ResourceCompilationException: Resource compilation failed (Failed to compile values resource file /home/vagrant/appbuild/app/build/intermediates/incremental/gitpull/mergeGitpullResources/merged.dir/values-it/values-it.xml. Cause: java.lang.IllegalStateException: Can not extract resource from com.android.aaptcompiler.ParsedResource@6580802d.). Check logs for more details.
157 at com.android.aaptcompiler.ResourceCompiler.compileResource(ResourceCompiler.kt:120)
158 at com.android.build.gradle.internal.res.ResourceCompilerRunnable$Companion.compileSingleResource(ResourceCompilerRunnable.kt:33)
159 at com.android.build.gradle.internal.res.ResourceCompilerRunnable.run(ResourceCompilerRunnable.kt:13)
160 at com.android.build.gradle.internal.profile.ProfileAwareWorkAction.execute(ProfileAwareWorkAction.kt:66)
161 at org.gradle.workers.internal.DefaultWorkerServer.execute(DefaultWorkerServer.java:68)
162 at org.gradle.workers.internal.NoIsolationWorkerFactory$1$1.create(NoIsolationWorkerFactory.java:64)
163 at org.gradle.workers.internal.NoIsolationWorkerFactory$1$1.create(NoIsolationWorkerFactory.java:61)
164 at org.gradle.internal.classloader.ClassLoaderUtils.executeInClassloader(ClassLoaderUtils.java:102)
165 at org.gradle.workers.internal.NoIsolationWorkerFactory$1.lambda$execute$0(NoIsolationWorkerFactory.java:61)
166 at org.gradle.workers.internal.AbstractWorker$1.call(AbstractWorker.java:44)
167 at org.gradle.workers.internal.AbstractWorker$1.call(AbstractWorker.java:41)
168 at org.gradle.internal.operations.DefaultBuildOperationRunner$CallableBuildOperationWorker.execute(DefaultBuildOperationRunner.java:209)
169 at org.gradle.internal.operations.DefaultBuildOperationRunner$CallableBuildOperationWorker.execute(DefaultBuildOperationRunner.java:204)
170 at org.gradle.internal.operations.DefaultBuildOperationRunner$2.execute(DefaultBuildOperationRunner.java:66)
171 at org.gradle.internal.operations.DefaultBuildOperationRunner$2.execute(DefaultBuildOperationRunner.java:59)
172 at org.gradle.internal.operations.DefaultBuildOperationRunner.execute(DefaultBuildOperationRunner.java:166)
173 at org.gradle.internal.operations.DefaultBuildOperationRunner.execute(DefaultBuildOperationRunner.java:59)
174 at org.gradle.internal.operations.DefaultBuildOperationRunner.call(DefaultBuildOperationRunner.java:53)
175 at org.gradle.workers.internal.AbstractWorker.executeWrappedInBuildOperation(AbstractWorker.java:41)
176 at org.gradle.workers.internal.NoIsolationWorkerFactory$1.execute(NoIsolationWorkerFactory.java:58)
177 at org.gradle.workers.internal.DefaultWorkerExecutor.lambda$submitWork$0(DefaultWorkerExecutor.java:176)
178 at org.gradle.internal.work.DefaultConditionalExecutionQueue$ExecutionRunner.runExecution(DefaultConditionalExecutionQueue.java:194)
179 at org.gradle.internal.work.DefaultConditionalExecutionQueue$ExecutionRunner.access$700(DefaultConditionalExecutionQueue.java:127)
180 at org.gradle.internal.work.DefaultConditionalExecutionQueue$ExecutionRunner$1.run(DefaultConditionalExecutionQueue.java:169)
181 at org.gradle.internal.Factories$1.create(Factories.java:30)
182 at org.gradle.internal.work.DefaultWorkerLeaseService.lambda$withLocksAcquired$0(DefaultWorkerLeaseService.java:269)
183 at org.gradle.internal.work.ResourceLockStatistics$1.measure(ResourceLockStatistics.java:42)
184 at org.gradle.internal.work.DefaultWorkerLeaseService.withLocksAcquired(DefaultWorkerLeaseService.java:267)
185 at org.gradle.internal.work.DefaultWorkerLeaseService.withLocks(DefaultWorkerLeaseService.java:259)
186 at org.gradle.internal.work.DefaultWorkerLeaseService.runAsWorkerThread(DefaultWorkerLeaseService.java:127)
187 at org.gradle.internal.work.DefaultWorkerLeaseService.runAsWorkerThread(DefaultWorkerLeaseService.java:132)
188 at org.gradle.internal.work.DefaultConditionalExecutionQueue$ExecutionRunner.runBatch(DefaultConditionalExecutionQueue.java:164)
189 at org.gradle.internal.work.DefaultConditionalExecutionQueue$ExecutionRunner.run(DefaultConditionalExecutionQueue.java:133)
190 ... 2 more
191Caused by: com.android.aaptcompiler.ResourceCompilationException: Failed to compile values resource file /home/vagrant/appbuild/app/build/intermediates/incremental/gitpull/mergeGitpullResources/merged.dir/values-it/values-it.xml
192 at com.android.aaptcompiler.ResourceCompiler.compileTable(ResourceCompiler.kt:179)
193 at com.android.aaptcompiler.ResourceCompiler.access$compileTable(ResourceCompiler.kt:1)
194 at com.android.aaptcompiler.ResourceCompiler$getCompileMethod$1.invoke(ResourceCompiler.kt:130)
195 at com.android.aaptcompiler.ResourceCompiler$getCompileMethod$1.invoke(ResourceCompiler.kt:130)
196 at com.android.aaptcompiler.ResourceCompiler.compileResource(ResourceCompiler.kt:116)
197 ... 34 more
198Caused by: java.lang.IllegalStateException: Can not extract resource from com.android.aaptcompiler.ParsedResource@6580802d.
199 at com.android.aaptcompiler.TableExtractor.extractResourceValues(TableExtractor.kt:248)
200 at com.android.aaptcompiler.TableExtractor.extract(TableExtractor.kt:162)
201 at com.android.aaptcompiler.ResourceCompiler.compileTable(ResourceCompiler.kt:175)
202 ... 38 more
203
204
205BUILD FAILED in 1m 14s
206

Build Log 6805 (remote - stdout)
25 - 50 - 100 - Unlimited Lines

1[INFO] User info: uid=1004(phabricator-android-builder) gid=1004(phabricator-android-builder) groups=1004(phabricator-android-builder),128(docker),1005(drydock)
2[INFO] UID=1004
3[INFO] GID=1004
4[INFO] IMAGE_NAME=fdroid-asder
5[INFO] SOURCE_DIR=/var/drydock/workingcopy-112/repo/libre-busto
6[ENTRYPOINT] RECEIVED MY_UID=1004
7[ENTRYPOINT] RECEIVED MY_GID=1004
8Executing command as vagrant with args
9ls /home/vagrant/source
10CACHEDIR set to /home/vagrant/.cache/gradlew-fdroid
11Update checksum from gradle-transparency-log
12Found 9.3.1 via distributionUrl
13Downloading missing gradle version 9.3.1
14Using cache directory /home/vagrant/.cache/gradlew-fdroid
15Running /home/vagrant/.cache/gradlew-fdroid/versions/9.3.1/bin/gradle --project-cache-dir /tmp/gradle-project-cache -Dorg.gradle.jvmargs=-Xmx2g --stacktrace assembleGitpull
16
17Welcome to Gradle 9.3.1!
18
19Here are the highlights of this release:
20 - Test reporting improvements
21 - Error and warning improvements
22 - Build authoring improvements
23
24For more details see https://docs.gradle.org/9.3.1/release-notes.html
25
26To honour the JVM settings for this build a single-use Daemon process will be forked. For more on this, please refer to https://docs.gradle.org/9.3.1/userguide/gradle_daemon.html#sec:disabling_the_daemon in the Gradle documentation.
27Daemon will be stopped at the end of the build
28
29> Configure project :app
30WARNING: The option setting 'android.enableAppCompileTimeRClass=false' is deprecated.
31The current default is 'true'.
32It will be removed in version 10.0 of the Android Gradle plugin.
33WARNING: The option setting 'android.nonFinalResIds=false' is deprecated.
34The current default is 'true'.
35It will be removed in version 10.0 of the Android Gradle plugin.
36WARNING: The multidex library is included as a dependency, but it is not needed for apps
37with minSdk >= 21. Please remove dependency 'androidx.multidex:multidex:2.0.1' from ':app'.
38See https://developer.android.com/build/multidex for more information.
39Checking the license for package Android SDK Build-Tools 36 in /opt/android-sdk/licenses
40License for package Android SDK Build-Tools 36 accepted.
41Preparing "Install Android SDK Build-Tools 36 v.36.0.0".
42"Install Android SDK Build-Tools 36 v.36.0.0" ready.
43Installing Android SDK Build-Tools 36 in /opt/android-sdk/build-tools/36.0.0
44"Install Android SDK Build-Tools 36 v.36.0.0" complete.
45"Install Android SDK Build-Tools 36 v.36.0.0" finished.
46Checking the license for package Android SDK Platform 36 in /opt/android-sdk/licenses
47License for package Android SDK Platform 36 accepted.
48Preparing "Install Android SDK Platform 36 (revision 2)".
49"Install Android SDK Platform 36 (revision 2)" ready.
50Installing Android SDK Platform 36 in /opt/android-sdk/platforms/android-36
51"Install Android SDK Platform 36 (revision 2)" complete.
52"Install Android SDK Platform 36 (revision 2)" finished.
53[========= ] 25%
54Checking the license for package Android SDK Platform-Tools in /opt/android-sdk/licenses
55License for package Android SDK Platform-Tools accepted.
56Preparing "Install Android SDK Platform-Tools v.37.0.1".
57"Install Android SDK Platform-Tools v.37.0.1" ready.
58Installing Android SDK Platform-Tools in /opt/android-sdk/platform-tools
59"Install Android SDK Platform-Tools v.37.0.1" complete.
60"Install Android SDK Platform-Tools v.37.0.1" finished.
61
62> Task :app:preBuild UP-TO-DATE
63> Task :app:preGitpullBuild UP-TO-DATE
64> Task :app:mergeGitpullJniLibFolders
65> Task :app:mergeGitpullArtProfile
66> Task :app:checkGitpullDuplicateClasses
67> Task :app:mergeGitpullNativeLibs
68> Task :app:generateGitpullBuildConfig
69> Task :app:protobufDummy UP-TO-DATE
70> Task :app:extractGitpullProto
71> Task :app:expandGitpullL8ArtProfileWildcards
72
73> Task :app:stripGitpullDebugSymbols
74Unable to strip the following libraries, packaging them as they are: libmaplibre.so. Run with --info option to learn more.
75
76> Task :app:extractIncludeGitpullProto
77> Task :app:extractProto
78> Task :app:extractGitpullNativeSymbolTables
79> Task :app:generateGitpullProto
80> Task :app:mergeGitpullNativeDebugMetadata NO-SOURCE
81> Task :app:checkGitpullAarMetadata
82> Task :app:mapGitpullSourceSetPaths
83> Task :app:processGitpullNavigationResources
84> Task :app:compileGitpullNavigationResources
85> Task :app:extractGitpullSupportedLocales
86> Task :app:generateGitpullResources
87> Task :app:generateGitpullLocaleConfig
88> Task :app:createGitpullCompatibleScreenManifests
89
90> Task :app:mergeGitpullResources
91
92> Task :app:extractDeepLinksGitpull
93
94> Task :app:processGitpullMainManifest
95/home/vagrant/appbuild/app/src/gitpull/AndroidManifest.xml Warning:
96 service#info.mqtt.android.service.MqttService was tagged at AndroidManifest.xml:0 to replace another declaration but no other declaration present
97/home/vagrant/appbuild/app/src/gitpull/AndroidManifest.xml Warning:
98 provider#org.acra.attachment.AcraContentProvider@android:authorities was tagged at AndroidManifest.xml:0 to replace other declarations but no other declaration present
99
100> Task :app:mergeGitpullResources FAILED
101> Task :app:processGitpullManifest
102
103[Incubating] Problems report is available at: file:///home/vagrant/appbuild/build/reports/problems/problems-report.html
104
105Deprecated Gradle features were used in this build, making it incompatible with Gradle 10.
106
107You can use '--warning-mode all' to show the individual deprecation warnings and determine if they come from your own scripts or plugins.
108
109For more on this, please refer to https://docs.gradle.org/9.3.1/userguide/command_line_interface.html#sec:command_line_warnings in the Gradle documentation.
11024 actionable tasks: 24 executed
111

Lease BusTO Working Copy

When
Completed at Fri, Oct 9, 12:06 · Built for 1 s
Status
Passed

Abort Older Builds

When
Completed at Fri, Oct 9, 12:06 · Built instantly
Status
Passed

Event Timeline