Page MenuHomeGitPull.it

Build 1500
FailedPublic

Drydock: Assemble debug APK using Docker Fabione asd

When
Completed at Fri, Oct 9, 12:08 · Built for 1 m, 25 s
Status
Failed
Description

This step will build an .apk using Gradle using this fantastic Docker image:

https://gitlab.com/fabmazz/android-fdroid-build-container/-/tree/ubuntu

Source code of this build step:

https://gitpull.it/source/libre-busto-ci-cd/browse/master/bin/fdroid-docker-builder.sh

TODO: Use the official image by Fabio Mazza, when the "DESIRED_UID" / "DESIRED_GID" features will be merged.

Build Log 6806 (remote - stderr)
25 - 50 - 100 - Unlimited Lines

106 at org.gradle.internal.execution.steps.BuildCacheStep.lambda$execute$1(BuildCacheStep.java:76)
107 at org.gradle.internal.Either$Right.fold(Either.java:176)
108 at org.gradle.internal.execution.caching.CachingState.fold(CachingState.java:62)
109 at org.gradle.internal.execution.steps.BuildCacheStep.execute(BuildCacheStep.java:74)
110 at org.gradle.internal.execution.steps.BuildCacheStep.execute(BuildCacheStep.java:49)
111 at org.gradle.internal.execution.steps.StoreExecutionStateStep.execute(StoreExecutionStateStep.java:46)
112 at org.gradle.internal.execution.steps.StoreExecutionStateStep.execute(StoreExecutionStateStep.java:35)
113 at org.gradle.internal.execution.steps.SkipUpToDateStep.executeBecause(SkipUpToDateStep.java:75)
114 at org.gradle.internal.execution.steps.SkipUpToDateStep.lambda$execute$2(SkipUpToDateStep.java:53)
115 at org.gradle.internal.execution.steps.SkipUpToDateStep.execute(SkipUpToDateStep.java:53)
116 at org.gradle.internal.execution.steps.SkipUpToDateStep.execute(SkipUpToDateStep.java:35)
117 at org.gradle.internal.execution.steps.legacy.MarkSnapshottingInputsFinishedStep.execute(MarkSnapshottingInputsFinishedStep.java:37)
118 at org.gradle.internal.execution.steps.legacy.MarkSnapshottingInputsFinishedStep.execute(MarkSnapshottingInputsFinishedStep.java:27)
119 at org.gradle.internal.execution.steps.ResolveIncrementalCachingStateStep.executeDelegate(ResolveIncrementalCachingStateStep.java:49)
120 at org.gradle.internal.execution.steps.ResolveIncrementalCachingStateStep.executeDelegate(ResolveIncrementalCachingStateStep.java:27)
121 at org.gradle.internal.execution.steps.AbstractResolveCachingStateStep.execute(AbstractResolveCachingStateStep.java:71)
122 at org.gradle.internal.execution.steps.AbstractResolveCachingStateStep.execute(AbstractResolveCachingStateStep.java:39)
123 at org.gradle.internal.execution.steps.ResolveChangesStep.executeMutable(ResolveChangesStep.java:63)
124 at org.gradle.internal.execution.steps.ResolveChangesStep.executeMutable(ResolveChangesStep.java:34)
125 at org.gradle.internal.execution.steps.MutableStep.execute(MutableStep.java:25)
126 at org.gradle.internal.execution.steps.ValidateStep.execute(ValidateStep.java:64)
127 at org.gradle.internal.execution.steps.ValidateStep.execute(ValidateStep.java:42)
128 at org.gradle.internal.execution.steps.AbstractCaptureStateBeforeExecutionStep.execute(AbstractCaptureStateBeforeExecutionStep.java:77)
129 at org.gradle.internal.execution.steps.AbstractCaptureStateBeforeExecutionStep.execute(AbstractCaptureStateBeforeExecutionStep.java:46)
130 at org.gradle.internal.execution.steps.AbstractSkipEmptyWorkStep.executeWithNonEmptySources(AbstractSkipEmptyWorkStep.java:133)
131 at org.gradle.internal.execution.steps.AbstractSkipEmptyWorkStep.execute(AbstractSkipEmptyWorkStep.java:59)
132 at org.gradle.internal.execution.steps.AbstractSkipEmptyWorkStep.execute(AbstractSkipEmptyWorkStep.java:36)
133 at org.gradle.internal.execution.steps.legacy.MarkSnapshottingInputsStartedStep.execute(MarkSnapshottingInputsStartedStep.java:38)
134 at org.gradle.internal.execution.steps.LoadPreviousExecutionStateStep.execute(LoadPreviousExecutionStateStep.java:36)
135 at org.gradle.internal.execution.steps.LoadPreviousExecutionStateStep.execute(LoadPreviousExecutionStateStep.java:23)
136 at org.gradle.internal.execution.steps.HandleStaleOutputsStep.executeMutable(HandleStaleOutputsStep.java:77)
137 at org.gradle.internal.execution.steps.HandleStaleOutputsStep.executeMutable(HandleStaleOutputsStep.java:43)
138 at org.gradle.internal.execution.steps.MutableStep.execute(MutableStep.java:25)
139 at org.gradle.internal.execution.steps.AssignMutableWorkspaceStep.lambda$execute$0(AssignMutableWorkspaceStep.java:35)
140 at org.gradle.api.internal.tasks.execution.TaskExecution$4.withWorkspace(TaskExecution.java:305)
141 at org.gradle.internal.execution.steps.AssignMutableWorkspaceStep.execute(AssignMutableWorkspaceStep.java:31)
142 at org.gradle.internal.execution.steps.AssignMutableWorkspaceStep.execute(AssignMutableWorkspaceStep.java:22)
143 at org.gradle.internal.execution.steps.ChoosePipelineStep.execute(ChoosePipelineStep.java:40)
144 at org.gradle.internal.execution.steps.ChoosePipelineStep.execute(ChoosePipelineStep.java:23)
145 at org.gradle.internal.execution.steps.ExecuteWorkBuildOperationFiringStep.lambda$execute$2(ExecuteWorkBuildOperationFiringStep.java:67)
146 at org.gradle.internal.execution.steps.ExecuteWorkBuildOperationFiringStep.execute(ExecuteWorkBuildOperationFiringStep.java:67)
147 at org.gradle.internal.execution.steps.ExecuteWorkBuildOperationFiringStep.execute(ExecuteWorkBuildOperationFiringStep.java:39)
148 at org.gradle.internal.execution.steps.IdentityCacheStep.execute(IdentityCacheStep.java:46)
149 at org.gradle.internal.execution.steps.IdentityCacheStep.execute(IdentityCacheStep.java:34)
150 at org.gradle.internal.execution.steps.IdentifyStep.execute(IdentifyStep.java:44)
151 at org.gradle.internal.execution.steps.IdentifyStep.execute(IdentifyStep.java:31)
152 at org.gradle.internal.execution.impl.DefaultExecutionEngine$1.execute(DefaultExecutionEngine.java:68)
153 at org.gradle.api.internal.tasks.execution.ExecuteActionsTaskExecuter.executeIfValid(ExecuteActionsTaskExecuter.java:132)
154 ... 30 more
155Caused by: com.android.aaptcompiler.ResourceCompilationException: Resource compilation failed (Failed to compile values resource file /home/vagrant/appbuild/app/build/intermediates/incremental/gitpull/mergeGitpullResources/merged.dir/values-it/values-it.xml. Cause: java.lang.IllegalStateException: Can not extract resource from com.android.aaptcompiler.ParsedResource@6580802d.). Check logs for more details.
156 at com.android.aaptcompiler.ResourceCompiler.compileResource(ResourceCompiler.kt:120)
157 at com.android.build.gradle.internal.res.ResourceCompilerRunnable$Companion.compileSingleResource(ResourceCompilerRunnable.kt:33)
158 at com.android.build.gradle.internal.res.ResourceCompilerRunnable.run(ResourceCompilerRunnable.kt:13)
159 at com.android.build.gradle.internal.profile.ProfileAwareWorkAction.execute(ProfileAwareWorkAction.kt:66)
160 at org.gradle.workers.internal.DefaultWorkerServer.execute(DefaultWorkerServer.java:68)
161 at org.gradle.workers.internal.NoIsolationWorkerFactory$1$1.create(NoIsolationWorkerFactory.java:64)
162 at org.gradle.workers.internal.NoIsolationWorkerFactory$1$1.create(NoIsolationWorkerFactory.java:61)
163 at org.gradle.internal.classloader.ClassLoaderUtils.executeInClassloader(ClassLoaderUtils.java:102)
164 at org.gradle.workers.internal.NoIsolationWorkerFactory$1.lambda$execute$0(NoIsolationWorkerFactory.java:61)
165 at org.gradle.workers.internal.AbstractWorker$1.call(AbstractWorker.java:44)
166 at org.gradle.workers.internal.AbstractWorker$1.call(AbstractWorker.java:41)
167 at org.gradle.internal.operations.DefaultBuildOperationRunner$CallableBuildOperationWorker.execute(DefaultBuildOperationRunner.java:209)
168 at org.gradle.internal.operations.DefaultBuildOperationRunner$CallableBuildOperationWorker.execute(DefaultBuildOperationRunner.java:204)
169 at org.gradle.internal.operations.DefaultBuildOperationRunner$2.execute(DefaultBuildOperationRunner.java:66)
170 at org.gradle.internal.operations.DefaultBuildOperationRunner$2.execute(DefaultBuildOperationRunner.java:59)
171 at org.gradle.internal.operations.DefaultBuildOperationRunner.execute(DefaultBuildOperationRunner.java:166)
172 at org.gradle.internal.operations.DefaultBuildOperationRunner.execute(DefaultBuildOperationRunner.java:59)
173 at org.gradle.internal.operations.DefaultBuildOperationRunner.call(DefaultBuildOperationRunner.java:53)
174 at org.gradle.workers.internal.AbstractWorker.executeWrappedInBuildOperation(AbstractWorker.java:41)
175 at org.gradle.workers.internal.NoIsolationWorkerFactory$1.execute(NoIsolationWorkerFactory.java:58)
176 at org.gradle.workers.internal.DefaultWorkerExecutor.lambda$submitWork$0(DefaultWorkerExecutor.java:176)
177 at org.gradle.internal.work.DefaultConditionalExecutionQueue$ExecutionRunner.runExecution(DefaultConditionalExecutionQueue.java:194)
178 at org.gradle.internal.work.DefaultConditionalExecutionQueue$ExecutionRunner.access$700(DefaultConditionalExecutionQueue.java:127)
179 at org.gradle.internal.work.DefaultConditionalExecutionQueue$ExecutionRunner$1.run(DefaultConditionalExecutionQueue.java:169)
180 at org.gradle.internal.Factories$1.create(Factories.java:30)
181 at org.gradle.internal.work.DefaultWorkerLeaseService.lambda$withLocksAcquired$0(DefaultWorkerLeaseService.java:269)
182 at org.gradle.internal.work.ResourceLockStatistics$1.measure(ResourceLockStatistics.java:42)
183 at org.gradle.internal.work.DefaultWorkerLeaseService.withLocksAcquired(DefaultWorkerLeaseService.java:267)
184 at org.gradle.internal.work.DefaultWorkerLeaseService.withLocks(DefaultWorkerLeaseService.java:259)
185 at org.gradle.internal.work.DefaultWorkerLeaseService.runAsWorkerThread(DefaultWorkerLeaseService.java:127)
186 at org.gradle.internal.work.DefaultWorkerLeaseService.runAsWorkerThread(DefaultWorkerLeaseService.java:132)
187 at org.gradle.internal.work.DefaultConditionalExecutionQueue$ExecutionRunner.runBatch(DefaultConditionalExecutionQueue.java:164)
188 at org.gradle.internal.work.DefaultConditionalExecutionQueue$ExecutionRunner.run(DefaultConditionalExecutionQueue.java:133)
189 ... 2 more
190Caused by: com.android.aaptcompiler.ResourceCompilationException: Failed to compile values resource file /home/vagrant/appbuild/app/build/intermediates/incremental/gitpull/mergeGitpullResources/merged.dir/values-it/values-it.xml
191 at com.android.aaptcompiler.ResourceCompiler.compileTable(ResourceCompiler.kt:179)
192 at com.android.aaptcompiler.ResourceCompiler.access$compileTable(ResourceCompiler.kt:1)
193 at com.android.aaptcompiler.ResourceCompiler$getCompileMethod$1.invoke(ResourceCompiler.kt:130)
194 at com.android.aaptcompiler.ResourceCompiler$getCompileMethod$1.invoke(ResourceCompiler.kt:130)
195 at com.android.aaptcompiler.ResourceCompiler.compileResource(ResourceCompiler.kt:116)
196 ... 34 more
197Caused by: java.lang.IllegalStateException: Can not extract resource from com.android.aaptcompiler.ParsedResource@6580802d.
198 at com.android.aaptcompiler.TableExtractor.extractResourceValues(TableExtractor.kt:248)
199 at com.android.aaptcompiler.TableExtractor.extract(TableExtractor.kt:162)
200 at com.android.aaptcompiler.ResourceCompiler.compileTable(ResourceCompiler.kt:175)
201 ... 38 more
202
203
204BUILD FAILED in 1m 14s
205

Build Log 6805 (remote - stdout)
25 - 50 - 100 - Unlimited Lines

11Found 9.3.1 via distributionUrl
12Downloading missing gradle version 9.3.1
13Using cache directory /home/vagrant/.cache/gradlew-fdroid
14Running /home/vagrant/.cache/gradlew-fdroid/versions/9.3.1/bin/gradle --project-cache-dir /tmp/gradle-project-cache -Dorg.gradle.jvmargs=-Xmx2g --stacktrace assembleGitpull
15
16Welcome to Gradle 9.3.1!
17
18Here are the highlights of this release:
19 - Test reporting improvements
20 - Error and warning improvements
21 - Build authoring improvements
22
23For more details see https://docs.gradle.org/9.3.1/release-notes.html
24
25To honour the JVM settings for this build a single-use Daemon process will be forked. For more on this, please refer to https://docs.gradle.org/9.3.1/userguide/gradle_daemon.html#sec:disabling_the_daemon in the Gradle documentation.
26Daemon will be stopped at the end of the build
27
28> Configure project :app
29WARNING: The option setting 'android.enableAppCompileTimeRClass=false' is deprecated.
30The current default is 'true'.
31It will be removed in version 10.0 of the Android Gradle plugin.
32WARNING: The option setting 'android.nonFinalResIds=false' is deprecated.
33The current default is 'true'.
34It will be removed in version 10.0 of the Android Gradle plugin.
35WARNING: The multidex library is included as a dependency, but it is not needed for apps
36with minSdk >= 21. Please remove dependency 'androidx.multidex:multidex:2.0.1' from ':app'.
37See https://developer.android.com/build/multidex for more information.
38Checking the license for package Android SDK Build-Tools 36 in /opt/android-sdk/licenses
39License for package Android SDK Build-Tools 36 accepted.
40Preparing "Install Android SDK Build-Tools 36 v.36.0.0".
41"Install Android SDK Build-Tools 36 v.36.0.0" ready.
42Installing Android SDK Build-Tools 36 in /opt/android-sdk/build-tools/36.0.0
43"Install Android SDK Build-Tools 36 v.36.0.0" complete.
44"Install Android SDK Build-Tools 36 v.36.0.0" finished.
45Checking the license for package Android SDK Platform 36 in /opt/android-sdk/licenses
46License for package Android SDK Platform 36 accepted.
47Preparing "Install Android SDK Platform 36 (revision 2)".
48"Install Android SDK Platform 36 (revision 2)" ready.
49Installing Android SDK Platform 36 in /opt/android-sdk/platforms/android-36
50"Install Android SDK Platform 36 (revision 2)" complete.
51"Install Android SDK Platform 36 (revision 2)" finished.
52[========= ] 25%
53Checking the license for package Android SDK Platform-Tools in /opt/android-sdk/licenses
54License for package Android SDK Platform-Tools accepted.
55Preparing "Install Android SDK Platform-Tools v.37.0.1".
56"Install Android SDK Platform-Tools v.37.0.1" ready.
57Installing Android SDK Platform-Tools in /opt/android-sdk/platform-tools
58"Install Android SDK Platform-Tools v.37.0.1" complete.
59"Install Android SDK Platform-Tools v.37.0.1" finished.
60
61> Task :app:preBuild UP-TO-DATE
62> Task :app:preGitpullBuild UP-TO-DATE
63> Task :app:mergeGitpullJniLibFolders
64> Task :app:mergeGitpullArtProfile
65> Task :app:checkGitpullDuplicateClasses
66> Task :app:mergeGitpullNativeLibs
67> Task :app:generateGitpullBuildConfig
68> Task :app:protobufDummy UP-TO-DATE
69> Task :app:extractGitpullProto
70> Task :app:expandGitpullL8ArtProfileWildcards
71
72> Task :app:stripGitpullDebugSymbols
73Unable to strip the following libraries, packaging them as they are: libmaplibre.so. Run with --info option to learn more.
74
75> Task :app:extractIncludeGitpullProto
76> Task :app:extractProto
77> Task :app:extractGitpullNativeSymbolTables
78> Task :app:generateGitpullProto
79> Task :app:mergeGitpullNativeDebugMetadata NO-SOURCE
80> Task :app:checkGitpullAarMetadata
81> Task :app:mapGitpullSourceSetPaths
82> Task :app:processGitpullNavigationResources
83> Task :app:compileGitpullNavigationResources
84> Task :app:extractGitpullSupportedLocales
85> Task :app:generateGitpullResources
86> Task :app:generateGitpullLocaleConfig
87> Task :app:createGitpullCompatibleScreenManifests
88
89> Task :app:mergeGitpullResources
90
91> Task :app:extractDeepLinksGitpull
92
93> Task :app:processGitpullMainManifest
94/home/vagrant/appbuild/app/src/gitpull/AndroidManifest.xml Warning:
95 service#info.mqtt.android.service.MqttService was tagged at AndroidManifest.xml:0 to replace another declaration but no other declaration present
96/home/vagrant/appbuild/app/src/gitpull/AndroidManifest.xml Warning:
97 provider#org.acra.attachment.AcraContentProvider@android:authorities was tagged at AndroidManifest.xml:0 to replace other declarations but no other declaration present
98
99> Task :app:mergeGitpullResources FAILED
100> Task :app:processGitpullManifest
101
102[Incubating] Problems report is available at: file:///home/vagrant/appbuild/build/reports/problems/problems-report.html
103
104Deprecated Gradle features were used in this build, making it incompatible with Gradle 10.
105
106You can use '--warning-mode all' to show the individual deprecation warnings and determine if they come from your own scripts or plugins.
107
108For more on this, please refer to https://docs.gradle.org/9.3.1/userguide/command_line_interface.html#sec:command_line_warnings in the Gradle documentation.
10924 actionable tasks: 24 executed
110

Lease BusTO Working Copy

When
Completed at Fri, Oct 9, 12:06 · Built for 1 s
Status
Passed

Abort Older Builds

When
Completed at Fri, Oct 9, 12:06 · Built instantly
Status
Passed

Event Timeline