Page MenuHomeGitPull.it

Build 260

Drydock: Run Gradle Lint Command

When
Completed at Feb 22 2021, 23:21 · Built for 7 s
Status
Failed
Description

Run a gradle lint.

It does not run the ./gradlew in order to do not provide an attack vector from untrusted commits.

Build Log 895 (remote - stderr)
25 - 50 - 100 - Unlimited Lines

109 location: class id
110/var/drydock/workingcopy-79/repo/libre-busto/src/it/reyboz/bustorino/ActivityMain.java:664: error: cannot find symbol
111 ft.add(R.id.resultFrame, fragment, "nearbyStop_correct");
112 ^
113 symbol: variable resultFrame
114 location: class id
115Note: Some input files use or override a deprecated API.
116Note: Recompile with -Xlint:deprecation for details.
117Note: /var/drydock/workingcopy-79/repo/libre-busto/src/it/reyboz/bustorino/middleware/AsyncDataDownload.java uses unchecked or unsafe operations.
118Note: Recompile with -Xlint:unchecked for details.
11923 errors
120
121FAILURE: Build failed with an exception.
122
123* What went wrong:
124Execution failed for task ':compileDebugJavaWithJavac'.
125> Compilation failed; see the compiler error output for details.
126
127* Try:
128Run with --stacktrace option to get the stack trace. Run with --info or --debug option to get more log output. Run with --scan to get full insights.
129
130* Get more help at https://help.gradle.org
131
132BUILD FAILED in 6s
133

Build Log 894 (remote - stdout)
25 - 50 - 100 - Unlimited Lines

16
17> Task :preReleaseBuild UP-TO-DATE
18> Task :compileReleaseAidl NO-SOURCE
19> Task :compileReleaseRenderscript
20> Task :generateReleaseBuildConfig UP-TO-DATE
21> Task :javaPreCompileRelease UP-TO-DATE
22> Task :generateReleaseResValues UP-TO-DATE
23> Task :generateReleaseResources
24> Task :createReleaseCompatibleScreenManifests UP-TO-DATE
25> Task :extractDeepLinksRelease UP-TO-DATE
26
27> Task :processReleaseManifest
28/var/drydock/workingcopy-79/repo/libre-busto/AndroidManifest.xml:39:9-45:51 Warning:
29 provider#org.acra.attachment.AcraContentProvider@android:authorities was tagged at AndroidManifest.xml:39 to replace other declarations but no other declaration present
30
31> Task :prepareLintJar UP-TO-DATE
32> Task :mergeDebugResources
33> Task :processDebugResources
34
35> Task :compileDebugJavaWithJavac
36
37> Task :compileDebugJavaWithJavac FAILED
38> Task :mergeReleaseResources
3919 actionable tasks: 8 executed, 11 up-to-date
40

Lease BusTO Working Copy

When
Completed at Feb 22 2021, 23:21 · Built for 1 s
Status
Passed

Wait for Previous Commits to Build

When
Completed at Feb 22 2021, 23:21 · Built for 32 s
Status
Passed

Event Timeline