Page MenuHomeGitPull.it

Build 1500
FailedPublic

Drydock: Assemble debug APK using Docker Fabione asd

When
Completed at Fri, Oct 9, 12:08 · Built for 1 m, 25 s
Status
Failed
Description

This step will build an .apk using Gradle using this fantastic Docker image:

https://gitlab.com/fabmazz/android-fdroid-build-container/-/tree/ubuntu

Source code of this build step:

https://gitpull.it/source/libre-busto-ci-cd/browse/master/bin/fdroid-docker-builder.sh

TODO: Use the official image by Fabio Mazza, when the "DESIRED_UID" / "DESIRED_GID" features will be merged.

Build Log 6806 (remote - stderr)
25 - 50 - 100 - Unlimited Lines

181 at org.gradle.internal.work.DefaultWorkerLeaseService.lambda$withLocksAcquired$0(DefaultWorkerLeaseService.java:269)
182 at org.gradle.internal.work.ResourceLockStatistics$1.measure(ResourceLockStatistics.java:42)
183 at org.gradle.internal.work.DefaultWorkerLeaseService.withLocksAcquired(DefaultWorkerLeaseService.java:267)
184 at org.gradle.internal.work.DefaultWorkerLeaseService.withLocks(DefaultWorkerLeaseService.java:259)
185 at org.gradle.internal.work.DefaultWorkerLeaseService.runAsWorkerThread(DefaultWorkerLeaseService.java:127)
186 at org.gradle.internal.work.DefaultWorkerLeaseService.runAsWorkerThread(DefaultWorkerLeaseService.java:132)
187 at org.gradle.internal.work.DefaultConditionalExecutionQueue$ExecutionRunner.runBatch(DefaultConditionalExecutionQueue.java:164)
188 at org.gradle.internal.work.DefaultConditionalExecutionQueue$ExecutionRunner.run(DefaultConditionalExecutionQueue.java:133)
189 ... 2 more
190Caused by: com.android.aaptcompiler.ResourceCompilationException: Failed to compile values resource file /home/vagrant/appbuild/app/build/intermediates/incremental/gitpull/mergeGitpullResources/merged.dir/values-it/values-it.xml
191 at com.android.aaptcompiler.ResourceCompiler.compileTable(ResourceCompiler.kt:179)
192 at com.android.aaptcompiler.ResourceCompiler.access$compileTable(ResourceCompiler.kt:1)
193 at com.android.aaptcompiler.ResourceCompiler$getCompileMethod$1.invoke(ResourceCompiler.kt:130)
194 at com.android.aaptcompiler.ResourceCompiler$getCompileMethod$1.invoke(ResourceCompiler.kt:130)
195 at com.android.aaptcompiler.ResourceCompiler.compileResource(ResourceCompiler.kt:116)
196 ... 34 more
197Caused by: java.lang.IllegalStateException: Can not extract resource from com.android.aaptcompiler.ParsedResource@6580802d.
198 at com.android.aaptcompiler.TableExtractor.extractResourceValues(TableExtractor.kt:248)
199 at com.android.aaptcompiler.TableExtractor.extract(TableExtractor.kt:162)
200 at com.android.aaptcompiler.ResourceCompiler.compileTable(ResourceCompiler.kt:175)
201 ... 38 more
202
203
204BUILD FAILED in 1m 14s
205

Build Log 6805 (remote - stdout)
25 - 50 - 100 - Unlimited Lines

86> Task :app:generateGitpullLocaleConfig
87> Task :app:createGitpullCompatibleScreenManifests
88
89> Task :app:mergeGitpullResources
90
91> Task :app:extractDeepLinksGitpull
92
93> Task :app:processGitpullMainManifest
94/home/vagrant/appbuild/app/src/gitpull/AndroidManifest.xml Warning:
95 service#info.mqtt.android.service.MqttService was tagged at AndroidManifest.xml:0 to replace another declaration but no other declaration present
96/home/vagrant/appbuild/app/src/gitpull/AndroidManifest.xml Warning:
97 provider#org.acra.attachment.AcraContentProvider@android:authorities was tagged at AndroidManifest.xml:0 to replace other declarations but no other declaration present
98
99> Task :app:mergeGitpullResources FAILED
100> Task :app:processGitpullManifest
101
102[Incubating] Problems report is available at: file:///home/vagrant/appbuild/build/reports/problems/problems-report.html
103
104Deprecated Gradle features were used in this build, making it incompatible with Gradle 10.
105
106You can use '--warning-mode all' to show the individual deprecation warnings and determine if they come from your own scripts or plugins.
107
108For more on this, please refer to https://docs.gradle.org/9.3.1/userguide/command_line_interface.html#sec:command_line_warnings in the Gradle documentation.
10924 actionable tasks: 24 executed
110

Lease BusTO Working Copy

When
Completed at Fri, Oct 9, 12:06 · Built for 1 s
Status
Passed

Abort Older Builds

When
Completed at Fri, Oct 9, 12:06 · Built instantly
Status
Passed

Event Timeline