Page MenuHomeGitPull.it

Build 268

You are viewing an older run of this build. View Current Build

History

Drydock: Run Gradle Lint Command

When
Completed at Apr 15 2021, 21:30 · Built for 20 s
Status
Failed
Description

Run a gradle lint.

It does not run the ./gradlew in order to do not provide an attack vector from untrusted commits.

Build Log 927 (remote - stderr)
25 - 50 - 100 - Unlimited Lines

24 location: class layout
25/var/drydock/workingcopy-79/repo/libre-busto/src/it/reyboz/bustorino/ActivityMain.java:159: error: cannot find symbol
26 Toolbar defToolbar = findViewById(R.id.that_toolbar);
27 ^
28 symbol: variable that_toolbar
29 location: class id
30Note: Some input files use or override a deprecated API.
31Note: Recompile with -Xlint:deprecation for details.
32Note: /var/drydock/workingcopy-79/repo/libre-busto/src/it/reyboz/bustorino/middleware/AsyncDataDownload.java uses unchecked or unsafe operations.
33Note: Recompile with -Xlint:unchecked for details.
346 errors
35
36FAILURE: Build failed with an exception.
37
38* What went wrong:
39Execution failed for task ':compileDebugJavaWithJavac'.
40> Compilation failed; see the compiler error output for details.
41
42* Try:
43Run with --stacktrace option to get the stack trace. Run with --info or --debug option to get more log output. Run with --scan to get full insights.
44
45* Get more help at https://help.gradle.org
46
47BUILD FAILED in 18s
48

Build Log 926 (remote - stdout)
25 - 50 - 100 - Unlimited Lines

1Found 6.1.1 via distributionUrl
2Running /home/phabricator-android-builder/versions/6.1.1/bin/gradle lint
3Starting a Gradle Daemon (subsequent builds will be faster)
4> Task :preBuild UP-TO-DATE
5> Task :preDebugBuild UP-TO-DATE
6> Task :compileDebugAidl NO-SOURCE
7> Task :generateDebugBuildConfig UP-TO-DATE
8> Task :compileDebugRenderscript
9> Task :javaPreCompileDebug UP-TO-DATE
10> Task :generateDebugResValues UP-TO-DATE
11> Task :generateDebugResources
12> Task :mergeDebugResources UP-TO-DATE
13> Task :createDebugCompatibleScreenManifests UP-TO-DATE
14> Task :extractDeepLinksDebug UP-TO-DATE
15> Task :processDebugManifest UP-TO-DATE
16> Task :processDebugResources UP-TO-DATE
17
18> Task :compileDebugJavaWithJavac
19
20> Task :compileDebugJavaWithJavac FAILED
2110 actionable tasks: 2 executed, 8 up-to-date
22

Lease BusTO Working Copy

When
Completed at Apr 15 2021, 21:30 · Built for 3 s
Status
Passed

Wait for Previous Commits to Build

When
Completed at Apr 15 2021, 21:30 · Built instantly
Status
Passed